{"text_format":"1","workbook":"xlsx","n_sheets":15,"sheets":["FFGym Clubs","FedA Tumbling avant","FedA Tumbling arrière","FedA MT - MT","ListeDiffSol","ListeClubs 95 ","liste","Activer Macro 97-2003","Activer Macro2007","Explications","Version","MessageErreurO365","fiche engagement","FED C - dif mini tramp","Fed C - dif tumbling"],"not_rendered":{"charts":0,"images":9,"macros":1,"external_links":1,"defined_names":71,"comments":0,"pivot_tables":0},"unopened":[],"bounds":{"document_bytes":16777216,"sheet_cells":100000,"rows_first":2000,"rows_last":500,"rows_between":2000,"halvings":0,"cell_chars":16384,"cell_head_chars":4096},"cells_cut":0,"cells_raw":0,"read":"whole","date_system":"1900"}

{"sheet":"FFGym Clubs","index":0,"n_rows":309,"n_cols":4,"rows_kept":309,"cut":false,"hidden":true,"merged":[]}
["Nom","Number","Numéro d'affiliation","Ville"]
[]
["1-CLUB INTROUVABLE ",1,"00000.000","INCONNUE"]
["A S C A",2,"52072.054","LA CHAPELLE ST-AUBIN"]
["A S COURONNAISE ",3,"28076.027","PETIT COURONNE"]
["A.S.P.C. GYM'SPORT",4,"52049.082","LES PONTS DE CE"]
["ABBEVILLE GYM",5,"32080.065","ABBEVILLE"]
["AC CHAPELAIN",6,"52044.061","LA CHAPELLE SUR ERDRE"]
["ACR GYM",7,"24041.061","ROMORANTIN"]
["ACRO VOLTIGE",8,"52085.103","LUCON"]
["ACTI' GYM CAVAILLON",9,"93084.135","CAVAILLON"]
["AG DE LA MONTAGNE",10,"52044.047","LA MONTAGNE"]
["AGM GYM VESOUL",11,"27070.055","VESOUL"]
["ALBONAISE GYMNASTIQUE DE FRANCONVILLE",12,"11095.301","FRANCONVILLE"]
["ALERTE SAINT GEORGES SUR CHER",13,"24041.063","SAINT GEORGES SUR CHER"]
["ALLIANCE TOURQUENNOISE DE GYMNASTIQUE",14,"32059.254","TOURCOING"]
["AMICALE DE VILLENEUVE LA GARENNE - COURS MUNICIPAL DE GYMNASTIQUE DE VILLENEUVE",15,"11092.251","VILLENEUVE LA GARENNE"]
["AMICALE LAIQUE BILLERE",16,"75064.103","BILLERE"]
["AMICALE LAIQUE DIGOIN",17,"27071.031","DIGOIN"]
["AMICALE LAIQUE JULES FERRY",18,"84001.021","AMBERIEU EN BUGEY"]
["AMICALE LAIQUE PARAY",19,"27071.038","PARAY LE MONIAL"]
["ANCIENNE ESPERANCE ANGOULEME",20,"75016.011","ANGOULÊME"]
["ANGERS GYMNASTIQUE",21,"52049.077","ANGERS"]
["ASS. SPORTIVE FOURCHAMBAULT",22,"27058.063","FOURCHAMBAULT"]
["ASS. SPORTIVE GUERIGNY URZY",23,"27058.005","GUERIGNY"]
["ASS.SPORT.UNION CHEMINOTTE",24,"27089.075","MIGENNES"]
["ASSOCIATION AMICALE SPORTIVE SARCELLES",25,"11095.317","SARCELLES"]
["ASSOCIATION AUXONNAISE DE GYM",26,"27021.077","AUXONNE"]
["ASSOCIATION EN FORM' SECTION GYM",27,"75079.097","MAUZE SUR LE MIGNON"]
["ASSOCIATION GRAINES D'ACROBATES",28,"03973.001","SAINT-LAURENT DU MARONI"]
["ASSOCIATION GYMNIQUE  LOUDUNAISE",29,"75086.034","LOUDUN"]
["ASSOCIATION GYMNIQUE DE BALAGNE",30,"94020.012","L'ILE  ROUSSE"]
["ASSOCIATION GYMNIQUE DE CESSON VERT ST DENIS",31,"11077.130","CESSON VERT SAINT DENIS"]
["ASSOCIATION GYMNIQUE DE CHOISY LE ROI",32,"11094.563","CHOISY LE ROI"]
["ASSOCIATION GYMNIQUE DE LATTES-MAURIN",33,"76034.003","MAURIN"]
["ASSOCIATION GYMNIQUE DE L'ORGE",34,"11091.122","SAINT MICHEL SUR ORGE"]
["ASSOCIATION GYMNIQUE DE PLOUGASTEL",35,"53029.086","PLOUGASTEL"]
["ASSOCIATION GYMNIQUE LA FAMECKOISE",36,"44057.014","FAMECK"]
["ASSOCIATION GYMNIQUE PERPIGNANAISE",37,"76066.053","PERPIGNAN"]
["ASSOCIATION GYMNIQUE REMOISE",38,"44051.048","REIMS"]
{"$rows_left_out":270}
{"sheet":"FedA Tumbling avant","index":1,"n_rows":14,"n_cols":5,"rows_kept":14,"cut":false,"hidden":true,"merged":[[9,0,10,0],[0,0,0,2],[2,0,8,0]]}
["Séries autorisées au Tumbling en avant\nTeamGym",null,null,null,{"$f":"COUNTA(B3:B14)","v":12}]
[null,"Séries","Valeur"]
[null,"Roulade avant",0.3]
[null,"Roue",0.5]
[null,"Roue Rondade",0.5]
[null,"Roue Roue pied pied",0.5]
[null,"Roue saut de mains",1.5]
[null,"Saut de mains",1.5]
[null,"Saut de mains 1 pied",1.5]
[null,"Saut de mains 1 pied Roue",1.5]
[null,"Saut de mains 1 pied Rondade",1.5]
[null,"Saut de mains 1 pied Saut de mains",1.5]
[null,"Salto av groupé",2]
[null,"Série Nulle",0]

{"sheet":"FedA Tumbling arrière","index":2,"n_rows":41,"n_cols":8,"rows_kept":41,"cut":false,"hidden":true,"merged":[[5,0,10,0],[0,0,0,2],[2,0,4,0]]}
["Séries autorisée au Tumbling en arrière\nTeamGym",null,null,{"$f":"COUNTA(SerieArriereTumblingFedA)","v":11}]
[null,"Séries","Valeur"]
[null,"Roue",0.5]
[null,"Roue pied pied",0.5]
[null,"Roue Roue pied pied",0.5]
[null,"Roue saut de mains",0.5]
[null,"Saut de mains 1 pied Roue",0.5]
[null,"Rondade",1]
[null,"Roue Rondade",1]
[null,"Saut de mains 1 pied Rondade",1]
[null,"Rondade flip",1.5]
[null,"Rondade salto groupé",2]
[null,"Série Nulle ",0]
[]
[]
[]
[]
[]
[]
[]
[]
[]
[]
[]
[]
[null,null,null,null,null,null,null,0]
[]
[]
[]
[]
[]
[]
[]
[]
[]
[]
[null,null,null,null,null,null,null,0]
[null,null,null,null,null,null,null,0]
[null,null,null,null,null,null,null,0]
[null,null,null,null,null,null,null,0]
{"$rows_left_out":2}
{"sheet":"FedA MT - MT","index":3,"n_rows":13,"n_cols":4,"rows_kept":13,"cut":false,"hidden":true,"merged":[[0,0,0,2],[2,0,9,0]]}
["Séries autorisées au Mini Trampoline et Table de Saut\nTeamGym",null,null,{"$f":"COUNTA(SerieMTMTFedA)","v":11}]
[null,"Eléments","Valeur "]
[null,"Saut groupé",1]
[null,"Saut droit",1]
[null,"Saut droit 1/2 tour",1.2]
[null,"Saut carpé serré",1.3]
[null,"Saut carpé écart",1.3]
[null,"Saut droit 1 tour",1.4]
[null,"Saut carpé écart 1/2 tour",1.5]
[null,"Salto av groupé",1.8]
[null,"Salto av carpé",1.9]
[null,"Salto av tendu",2]
[null,"Passage Nul",0]

{"sheet":"ListeDiffSol","index":4,"n_rows":167,"n_cols":14,"rows_kept":167,"cut":false,"hidden":true,"merged":[[0,6,0,11],[0,0,0,5]]}
["Fédérale",null,null,null,null,null,"Performance"]
[]
["Saut","Pivots","Maintien","Elément de force","Mixte","GE","Combi","Saut","Pivots","Maintien","Elément de force","Mixte","GE","Acro"]
[]
["S201","P201","M202",null,"M202","G401","P1003","S1001","P1003","M1001","EF1005","A1002","G401","A1002"]
["S202","P202","M204",null,"M204",null,"P1004","S1002","P1004","M1002","EF1012","A1003","G601","A1003"]
["S204","P401","M206",null,"M206",null,"P1201","S1004","P1201","M1003","EF1013","A203","G602","A203"]
["S210","P402","M402",null,"M402",null,"P1202","S1007","P1202","M1006","EF1206","A205","G802","A205"]
["S211","P403","M404",null,"M404",null,"P1204","S1008","P1204","M1201","EF1210","A401",null,"A401"]
["S214",null,"M406",null,"M406",null,"P201","S1010","P201","M1202","EF1211","A402",null,"A402"]
["S215",null,"MM201",null,"MM201",null,"P202","S1016","P202","M1204","EF1407","A403",null,"A403"]
["S220",null,"MM202",null,"MM202",null,"P401","S1017","P401","M1206","EF1408","A404",null,"A404"]
["S401",null,"MM204",null,"MM204",null,"P402","S1018","P402","M1207","EF1411","A602",null,"A602"]
["S403",null,"MM206",null,"MM206",null,"P403","S1019","P403","M202","EF1412","A603",null,"A603"]
["S406",null,"MM207",null,"MM207",null,"P601","S1020","P601","M204","EF1608","A605",null,"A605"]
["S409",null,"MM208",null,"MM208",null,"P602","S1022","P602","M206","EF1610","A801",null,"A801"]
["S410",null,"MM402",null,"MM402",null,"P604","S1201","P604","M402","EF1611","A802",null,"A802"]
["S411",null,"MM403",null,"MM403",null,"P801","S1202","P801","M404","EF809","A803",null,"A803"]
["S412",null,"MM404",null,"MM404",null,"P802","S1208","P802","M406","EF810","A804",null,"A804"]
["S415",null,"MM405",null,"MM405",null,"P803","S1209A","P803","M601","EF812","A805",null,"A805"]
["S416",null,null,null,"P201",null,"S1001","S1209B",null,"M603",null,"EF1005"]
["S418",null,null,null,"P202",null,"S1002","S1212",null,"M604",null,"EF1012"]
["S420",null,null,null,"P401",null,"S1004","S1214",null,"M605",null,"EF1013"]
[null,null,null,null,"P402",null,"S1007","S1216",null,"M805",null,"EF1206"]
[null,null,null,null,"P403",null,"S1008","S1219",null,"M807",null,"EF1210"]
[null,null,null,null,"S201",null,"S1010","S1220",null,"MM1001",null,"EF1211"]
[null,null,null,null,"S202",null,"S1016","S1222",null,"MM1005",null,"EF1407"]
[null,null,null,null,"S204",null,"S1017","S201",null,"MM1006",null,"EF1408"]
[null,null,null,null,"S210",null,"S1018","S202",null,"MM1202",null,"EF1411"]
[null,null,null,null,"S211",null,"S1019","S204",null,"MM1403",null,"EF1412"]
[null,null,null,null,"S214",null,"S1020","S210",null,"MM201",null,"EF1608"]
[null,null,null,null,"S215",null,"S1022","S211",null,"MM202",null,"EF1610"]
[null,null,null,null,"S220",null,"S1201","S214",null,"MM204",null,"EF1611"]
[null,null,null,null,"S401",null,"S1202","S215",null,"MM206",null,"EF809"]
[null,null,null,null,"S403",null,"S1208","S220",null,"MM207",null,"EF810"]
[null,null,null,null,"S406",null,"S1209A","S401",null,"MM208",null,"EF812"]
[null,null,null,null,"S409",null,"S1209B","S403",null,"MM402",null,"G401"]
[null,null,null,null,"S410",null,"S1212","S406",null,"MM403",null,"G601"]
[null,null,null,null,"S411",null,"S1214","S409",null,"MM404",null,"G602"]
[null,null,null,null,"S412",null,"S1216","S410",null,"MM405",null,"G802"]
{"$rows_left_out":128}
{"sheet":"ListeClubs 95 ","index":5,"n_rows":191,"n_cols":6,"rows_kept":191,"cut":false,"hidden":true,"merged":[]}
["Nom","Numéro d'affiliation","Abréviation","Région","Département","Ville"]
["UNION KOENIGSHOFFEN","01067.077","UNION KOENIGSHOFFEN","ALSACE","BAS RHIN","KOENIGSHOFFEN"]
["SOCIETE DE GYMNASTIQUE MASEVAUX","01068.039","S.G. MASEVAUX","ALSACE","HAUT RHIN","MASEVAUX"]
["SOCIETE DE GYMNASTIQUE SAUSHEIM","01068.054","S.G. SAUSHEIM","ALSACE","HAUT RHIN","SAUSHEIM"]
["EAST FRANCE TEAMGYM","01068.154",null,"ALSACE","HAUT RHIN","RIBEAUVILLE"]
["L'UNION SPORTIVE TALENCAISE","02033.004","L'US TALENCE","AQUITAINE","GIRONDE","TALENCE"]
["LE STADE PESSACAIS UNION CLUB","02033.005","SPUC PESSAC","AQUITAINE","GIRONDE","PESSAC"]
["LA VAILLANTE DE LANGON","02033.006","LA V. LANGON","AQUITAINE","GIRONDE","LANGON"]
["LES JEUNES DU CAPTALAT LA TESTE","02033.009","JC LA TESTE","AQUITAINE","GIRONDE","LA TESTE"]
["ASSOCIATION SPORTIVE ET CULTURELLE PESSAC ALOUETTE","02033.010","ASCPA PESSAC","AQUITAINE","GIRONDE","PESSAC ALOUETTE"]
["ENTENTE SPORTIVE DE BRUGES","02033.012","ES BRUGES","AQUITAINE","GIRONDE","BRUGES"]
["ASSOCIATION SPORTIVE LE HAILLAN GYM","02033.018","A.S LE HAILLAN GYM","AQUITAINE","GIRONDE","LE HAILLAN"]
["ASSOCIATION SPORTIVE ILLACAISE","02033.069","AS ILLACAISE","AQUITAINE","GIRONDE","ST JEAN D'ILLAC"]
["CLUB DEPARTEMENTAL DE GYMNASTIQUE GIRONDE","02033.074","CD GYM 33","AQUITAINE","GIRONDE","BORDEAUX"]
["ASSOCIATION SPORTIVE LOS SAUTAPRATS DE COARRAZE NAY","02064.123","AS LOS SAUTAPRATS COARRAZE NAY","AQUITAINE","PYRENEES ATLANTIQUES","NAY"]
["LA BELLERIVOISE","03003.024","LA BELLERIVOISE","AUVERGNE","ALLIER","BELLERIVE SUR ALLIER"]
["LA FRANCAISE","03003.026","LA FRANCAISE","AUVERGNE","ALLIER","CUSSET"]
["ILETS SPORTS MONTLUCONNAIS","03003.031","ILETS SPORTS MONTLUCONNAIS","AUVERGNE","ALLIER","MONTLUÇON"]
["LA BOURBONNAISE","03003.032","LA BOURBONNAISE","AUVERGNE","ALLIER","MOULINS"]
["ESPERANCE ST-GERMANOISE","03003.053","ESPERANCE ST-GERMANOISE","AUVERGNE","ALLIER","ST GERMAIN DES FOSSÉS"]
["VICHY GYM","03003.059","VICHY GYM","AUVERGNE","ALLIER","VICHY"]
["ENTENTE GYMNIQUE GANNATOISE","03003.077","E.G. GANNATOISE","AUVERGNE","ALLIER","GANNAT"]
["LA JEANNE D ARC","03015.033","LA JEANNE D'ARC","AUVERGNE","CANTAL","MAURIAC"]
["ASSOCIATION SPORTIVE MONTFERRANDAISE","03063.002","A.S. MONTFERRANDAISE","AUVERGNE","PUY DE DOME","CLERMONT-FD"]
["UNION SPORTIVE DE CHAMALIERES","03063.009","U.S. CHAMALIERES","AUVERGNE","PUY DE DOME","CHAMALIÈRES"]
["LA GAULOISE MOZAC","03063.014","LA GAULOISE MOZAC","AUVERGNE","PUY DE DOME","MOZAC"]
["UNION SPORTIVE VIC LE COMTE GYMNASTIQUE","03063.022","U.S. VIC LE COMTE","AUVERGNE","PUY DE DOME","VIC LE COMTE"]
["ASS. SPORTIVE GUERIGNY URZY","04058.005","A.S.GUERIGNY URZY","BOURGOGNE","NIEVRE","GUERIGNY"]
["ESPERANCE ST LEGER GYMNASTIQUE","04058.006","E. S. L. GYMNASTIQUE","BOURGOGNE","NIEVRE","ST LEGER DES VIGNES"]
["CERCLE SPORTIF LAIC","04071.021","CERCLE SPORTIF LAIC","BOURGOGNE","SAONE ET LOIRE","SAINT VALLIER"]
["ASSOCIATION GYMNIQUE DE PLOUGASTEL","05029.086","AG PLOUGASTEL","BRETAGNE","FINISTERE","PLOUGASTEL"]
["CERCLE PAUL BERT","05035.009","CERCLE PAUL BERT","BRETAGNE","ILLE ET VILAINE","RENNES"]
["KEWENN GYMNASTIQUE","05056.160","KEWENN GYM","BRETAGNE","MORBIHAN","QUEVEN"]
["L'UNION D'AY","06051.020","L'UNION D'AY","CHAMPAGNE-ARDENNE","MARNE","AY"]
["LA CHAUMONTAISE","06052.025","LA CHAUMONTAISE","CHAMPAGNE-ARDENNE","HAUTE MARNE","CHAUMONT"]
["RAYON SPORTIF BRAGARD ST DIZIER","06052.055","RSB ST DIZIER","CHAMPAGNE-ARDENNE","HAUTE MARNE","SAINT DIZIER"]
["AMICALE LAIQUE JULES FERRY","08001.021","ALJF Ambérieu","RHONE ALPES","AIN","AMBERIEU EN BUGEY"]
["LES ENFANTS DU DEVOIR","08001.024","LES ENFANTS DU DEVOIR","RHONE ALPES","AIN","OYONNAX"]
["AVENIR GESSIEN DE THOIRY","08001.062","AVENIR GESSIEN","RHONE ALPES","AIN","THOIRY"]
["LA SEREINE DE MONTLUEL","08001.063","SM","RHONE ALPES","AIN","MONTLUEL"]
{"$rows_left_out":152}
{"sheet":"liste","index":6,"n_rows":21,"n_cols":14,"rows_kept":21,"cut":false,"hidden":true,"merged":[]}
[]
["FédéralA",1,null,"Finale C","Junior",1]
["FédéralB",1,"Adulte","Finale B","Senior",2,null,"FédéralA","FédéralB","FédéralC","NationalA","NationalB","NationalC","Europe"]
["FédéralC",2,"Féminine","Finale C",null,3,null,"Adultes","Adultes","Unique","Junior ","Mix/Masc","Junior","Senior Féminine"]
["NationalA",2,"Masc/Mix","Finale D",null,4,null,"Mix/Masc","Mix/Masc",null,"Unique","Fem","Unique","Senior Masculine"]
["NationalB",2,"Unique",null,null,null,null,"Fem","Fem",null,null,"Junior",null,"Senior Mixte"]
["NationalC",3,null,null,null,null,null,"Unique","Unique",null,null,null,null,"Junior Féminine"]
["Europe",3,null,null,{"$f":"INDIRECT(A2)","v":{"$error":"#VALUE!"}},null,null,null,null,null,null,null,null,"Junior Masculine"]
[null,3,"Féminine",null,null,null,null,null,null,null,null,null,null,"Junior Mixte"]
[null,4,"Masculine"]
["Catégorie",5,"Mixte"]
["Découverte"]
["Evolution"]
["Détente"]
["Passion"]
[]
[]
[null,null,1]
[null,null,2]
[null,null,3]
[null,null,4]

{"sheet":"Activer Macro 97-2003","index":7,"n_rows":71,"n_cols":1,"rows_kept":71,"cut":false,"hidden":false,"merged":[]}
["pour activer les macros :"]
[]
["en résumé : menu Excel ->"]
["Outils > Macros > Sécurité > cocher niveau sécurité moyen"]
[]
["en images:"]
[]
[]
[]
[]
[]
[]
[]
[]
[]
[]
[]
[]
[]
[]
[]
[]
[]
[]
[]
[]
[]
[]
[]
[]
[]
[]
[]
[]
[]
[]
[]
[]
[-2]
[]
{"$rows_left_out":32}
{"sheet":"Activer Macro2007","index":8,"n_rows":30,"n_cols":2,"rows_kept":30,"cut":false,"hidden":false,"merged":[]}
[]
[]
[]
[]
[]
[]
[]
[]
[]
[]
[]
[]
[]
[]
[]
[]
[]
[]
[]
[]
[]
[]
[]
[]
[]
[]
[]
[]
[]
[null,"fermer le fichier, puis l'ouvrir à nouveau "]

{"sheet":"Explications","index":9,"n_rows":49,"n_cols":4,"rows_kept":49,"cut":false,"hidden":false,"merged":[[41,1,41,10],[43,1,43,10],[44,1,44,10],[25,1,25,10],[26,1,26,10],[29,1,29,10],[33,1,33,10],[34,1,34,10],[36,1,36,10],[24,1,24,10],[8,1,8,11],[9,1,9,10],[10,1,10,10],[12,1,12,10],[14,1,14,10],[16,1,16,10],[17,1,17,10],[19,1,19,10],[21,1,21,10],[22,1,22,10],[23,1,23,10],[1,3,2,9],[3,3,3,9],[5,1,5,10],[6,1,6,10],[7,1,7,11]]}
[]
[null,null,null,"FEUILLES DE DIFF - MODE D'EMPLOI"]
[]
[null,null,null,"V1.0"]
[]
[null,"Cet onglet permet de vous expliquer chaque étape de cet outil. "]
[null,"Comment activer les macros"]
[null,"Allez sur les onglets en fonction de votre version, ou regardez sur internet"]
[]
[null,"Explication des onglets"]
[]
[]
[]
[]
[]
[]
[]
[]
[]
[]
[]
[]
[]
[]
[]
[]
[]
[]
[]
[]
[]
[]
[]
[]
[]
[]
[]
[]
[]
[]
{"$rows_left_out":10}
{"sheet":"Version","index":10,"n_rows":1,"n_cols":2,"rows_kept":1,"cut":false,"hidden":true,"merged":[]}
[2,"Ajout modif pour Fed C "]

{"sheet":"MessageErreurO365","index":11,"n_rows":15,"n_cols":2,"rows_kept":15,"cut":false,"hidden":false,"merged":[[12,0,12,3]]}
["Si vous voyez le message suivant : "]
[]
[]
[]
[]
[]
[]
[]
[]
[]
[]
[null,"Vous pouvez cliquer sur le lien pour plus d'explication : "]
["Actions à effectuer sur chaque ordiniateur "]
[null,"1 - Copiez toutes vos feuilles pour la compétition dans un répertoire ( qui lui-même peut contenir d'autres répertoires) :"]
[null,"2 - Suivre la procédure suivante :"]

{"sheet":"fiche engagement","index":12,"n_rows":18,"n_cols":8,"rows_kept":18,"cut":false,"hidden":false,"merged":[[10,0,10,1],[15,0,15,1],[15,2,15,4],[17,1,17,4],[12,2,14,4],[8,0,8,1],[0,0,0,5],[1,0,1,5],[2,0,2,5],[4,0,4,5],[6,0,6,1],[6,2,6,3],[3,0,3,5],[5,0,5,5]]}
["Fiche d'engagement Compétition TeamGym - SAISON 2023 - 2024 - V1.1 FEDC"]
["ENGAGEMENT EN LIGNE"]
["Remplir une feuille par équipe de compétition et remplissez toutes les cases."]
["Les cases grises sont des listes déroulantes."]
["Les cases bleues sont des zones de texte à compléter"]
["Les cases roses sont remplies automatiquement"]
["Help",null,"responsablejugeteamgym@ffgym.fr"]
[]
["Catégories:",null,"FédéralC","Finale:","FinaleA"]
[]
["Section:",null,"Unique","Equipe numéro :",1]
[]
[]
[]
["Nom de l'association :"]
["Code Informatique:",null,{"$f":"IF(H16=0,\" \",INDEX('FFGym Clubs'!C3:C325,H16))","v":" "},null,null,null,null,{"$f":"SUM(('FFGym Clubs'!A2:A325=$C$13)*('FFGym Clubs'!B2:B325))","v":0}]
[]
["Ville :",{"$f":"IF(H16=0,\" \",INDEX('FFGym Clubs'!D3:D325,'fiche engagement'!H16))","v":" "}]

{"sheet":"FED C - dif mini tramp","index":13,"n_rows":41,"n_cols":14,"rows_kept":41,"cut":false,"hidden":false,"merged":[[10,1,10,2],[0,1,0,2],[1,1,1,2],[2,1,2,2],[3,1,3,2],[4,1,4,2],[5,1,5,2],[6,1,6,2],[6,9,6,10],[7,1,7,2],[8,1,8,2],[9,1,9,2],[28,2,28,9],[11,1,11,2],[12,1,12,2],[12,9,12,10],[13,2,13,10],[15,2,15,9],[16,2,21,9],[24,2,24,6],[24,7,24,9],[25,2,25,9],[26,2,26,9],[27,2,27,9],[36,2,36,9],[37,2,37,9],[38,2,38,9],[39,2,39,9],[29,2,29,9],[30,2,30,9],[33,2,33,6],[33,7,33,9],[34,2,34,9],[35,2,35,9]]}
[null,"Difficulté",null,"Nat A","Nat B","Nat C","Fed A/C","Fed B",null,null,null,"Case option pour les series avant arriere"]
[null,"Saut pose de pieds + saut droit",null,null,null,null,null,null,null,null,null,1,2,2]
[null,"Roue/Rondade"]
[null,"Rondade",null,"0.5",1,11,null,null,null,null,null,{"$f":"'fiche engagement'!$C$9","v":"FédéralC"}]
[null,"Rondade demi -Pétrick",null,"0.7","1.2","1.2"]
[null,"Lune",null,1,"1.6","1.6"]
[null,"Lune vrille",null,"1.4",2,null,null,null,null,"Valorisation"]
[null,"Tsukahara",null,"1.6",null,null,null,null,"TOTAL","1/2 vrille",0.2]
[null,"Lune salto",null,"1.8",null,null,null,null,"DIFF","carpé",0.1]
[null,"Saut droit",null,null,null,null,1,"1.2",{"$f":"K23+K32+K41","v":0},"tendu",0.2]
[null,"Saut groupé",null,null,null,null,1,"1.5",null,"double",1]
[null,"Saut écart carpé",null,null,1,1,"1.3 (serré)","1.8 (serré)"]
[null,"Salto",null,1,"1.4","1.4","1.8",2,"Catégorie ",{"$f":"CONCATENATE('fiche engagement'!C9,\" \", 'fiche engagement'!C11,\" \", 'fiche engagement'!E9)","v":"FédéralC Unique FinaleA"}]
[null,"Equipe ",{"$f":"CONCATENATE(INDEX('FFGym Clubs'!D3:D325,'fiche engagement'!H16),\" - Equipe N°\",'fiche engagement'!E11)","v":"FRANCONVILLE - Equipe N°1"}]
[null,"1er Passage"]
["N°","Nom du gym",null,null,null,null,null,null,null,null,"Valeur"]
[1]
[2]
[3]
[4]
[5]
[6]
[null,null,null,null,null,null,null,null,null,"Moyenne du passage : ",{"$f":"ROUND(SUM(K17:K22)/6,1)","v":0}]
[null,"2ème Passage"]
["N°","Nom du gym",null,null,null,null,null,null,null,null,"Valeur"]
[1]
[2]
[3]
[4]
[5]
[6]
[null,null,null,null,null,null,null,null,null,"Moyenne du passage : ",{"$f":"IF(K26=\"\",0,ROUND(AVERAGE(K26:K28),1))","v":0}]
[null,"3ème Passage"]
["N°","Nom du gym",null,null,null,null,null,null,null,null,"Valeur"]
[1]
[2]
[3]
[4]
[5]
[6]
{"$rows_left_out":2}
{"sheet":"Fed C - dif tumbling","index":14,"n_rows":41,"n_cols":14,"rows_kept":41,"cut":false,"hidden":false,"merged":[[5,1,5,2],[0,1,0,2],[1,1,1,2],[2,1,2,2],[3,1,3,2],[4,1,4,2],[6,1,6,2],[7,1,7,2],[8,1,8,2],[9,1,9,2],[10,1,10,2],[30,2,30,9],[11,9,11,10],[12,1,12,2],[13,2,13,10],[15,2,15,9],[16,2,21,9],[22,2,22,9],[11,1,11,2],[25,2,25,9],[26,2,26,9],[27,2,27,9],[28,2,28,9],[29,2,29,9],[39,2,39,9],[40,2,40,9],[31,2,31,9],[34,2,34,9],[35,2,35,9],[36,2,36,9],[37,2,37,9],[38,2,38,9]]}
[null,"Difficultés",null,"Nat A","Nat B","Nat C","Fed A/C","Fed B",null,null,null,"Case option pour les series avant arriere"]
["Av","Roulade avant",null,null,null,null,"0.3","0.5",null,null,null,2,1,2]
["Avt \nArr","Roue",null,null,"0.5","0.5","0.5",1]
["Arr","Roue pied pied",null,null,"0.5","0.5","0.5",1,null,null,null,{"$f":"'fiche engagement'!C9","v":"FédéralC"}]
["Arr","Rondade",null,null,"0.5","0.5",1,"1.5"]
["Avt","Saut de mains",null,"0.3",1,1,"1.5",2,null,"1/2 vrille",0.2]
["Avt","Saut de mains un pied",null,"0.3",1,1,"1.5",2,"TOTAL","carpé",0.1]
["Avt","Flip avant",null,"0.7","1.2","1.2",null,null,"DIFF","tendu",0.2]
["Arr","Flip arrière",null,"0.3",1,1,"1.5",2,{"$f":"(K23+K32+K41)","v":0},"double",1]
["Avt","Salto en avant",null,1,"1.4","1.4",2,null,null,"Salto salto",0.2]
["Arr","Salto en arrière",null,1,"1.4","1.4",2,null,null,"salto au départ",0.1]
["Avt","Saut de mains Salto",null,"1.2","1.6","1.6",null,null,"Catégorie:",{"$f":"CONCATENATE('fiche engagement'!C9,\" \", 'fiche engagement'!C11,\" \", 'fiche engagement'!E9)","v":"FédéralC Unique FinaleA"}]
["Avt","Flip avant Salto",null,"1.4","1.8"]
[null,"Equipe",{"$f":"CONCATENATE(INDEX('FFGym Clubs'!D3:D325,'fiche engagement'!H16),\" - Equipe N°\",'fiche engagement'!E11)","v":"FRANCONVILLE - Equipe N°1"}]
[null,"1er Passage"]
["N°","Nom du gym",null,null,null,null,null,null,null,null,"Valeur"]
[1]
[2]
[3]
[4]
[5]
[6]
[null,null,"Moyenne du passage : ",null,null,null,null,null,null,null,{"$f":"ROUND(SUM(K17:K19)/3,1)","v":0}]
[null,"2ème Passage"]
["N°","Nom du gym",null,null,null,null,null,null,null,null,"Valeur"]
[1]
[2]
[3]
[4]
[5]
[6]
[null,null,"Moyenne du passage : ",null,null,null,null,null,null,null,{"$f":"IF(K26<>\"\",ROUND(AVERAGE(K26:K28),1),0)","v":0}]
[null,"3ème Passage"]
["N°","Nom du gym",null,null,null,null,null,null,null,null,"Valeur"]
[1]
[2]
[3]
[4]
[5]
[6]
{"$rows_left_out":1}